BDBM50320084 (2R,2aR,2a1S,5aR)-2-(cyclopropylmethylamino)-7-hydroxy-2,2a,2a1,3,4,5a-hexahydrophenanthro[4,5-bcd]furan-5(1H)-one::CHEMBL1083953
SMILES Oc1ccc2C[C@@H](NCC3CC3)[C@@H]3CCC(=O)[C@@H]4Oc1c2[C@H]34
InChI Key InChIKey=NZQNKNYYLWWVAO-GWLLULGVSA-N
Data  2 KI
  Tab Delimited (TSV)   2D SDfile   Computed 3D by Vconf -m prep SDfile
Find this compound or compounds like it in BindingDB:
Activity Spreadsheet -- Enzyme Inhibition Constant Data from BindingDB
Found 2 hits for monomerid = 50320084
TargetMu-type opioid receptor(GUINEA PIG)
Kitasato University
Curated by ChEMBL
LigandPNGBDBM50320084((2R,2aR,2a1S,5aR)-2-(cyclopropylmethylamino)-7-hyd...)
Affinity DataKi:  30.3nM. Assay description: Displacement of [3H]DAMGO from mu opioid receptor in Hartley guinea pig forebrain by liquid scintillation counting
In DepthDetails ArticlePubMed
TargetKappa-type opioid receptor(Cavia porcellus (domestic guinea pig))
Kitasato University
Curated by ChEMBL
LigandPNGBDBM50320084((2R,2aR,2a1S,5aR)-2-(cyclopropylmethylamino)-7-hyd...)
Affinity DataKi:  32.2nM. Assay description: Displacement of [3H]U69493 from kappa opioid receptor in Hartley guinea pig cerebellum by liquid scintillation counter
In DepthDetails ArticlePubMed