BDBM50320135 CHEMBL1085258::N-benzyl-4-((N-benzyl-4-methoxyphenylsulfonamido)methyl)benzamide
SMILES COc1ccc(cc1)S(=O)(=O)N(Cc1ccccc1)Cc1ccc(cc1)C(=O)NCc1ccccc1
InChI Key InChIKey=AHMFXDVNFSUGOJ-UHFFFAOYSA-N
Data  1 IC50
  Tab Delimited (TSV)   2D SDfile   Computed 3D by Vconf -m prep SDfile
Find this compound or compounds like it in BindingDB:
Activity Spreadsheet -- Enzyme Inhibition Constant Data from BindingDB
Found 1 hit for monomerid = 50320135
TargetC-X-C chemokine receptor type 3(Homo sapiens (Human))
Merck Serono
Curated by ChEMBL
LigandPNGBDBM50320135(CHEMBL1085258 | N-benzyl-4-((N-benzyl-4-methoxyphe...)
Affinity DataIC50:  347nM. Assay description: Antagonist activity at human CXCR3 expressed in mouse L1.2 cells assessed as inhibition of IP10-induced chemotaxis after 4 hrs
In DepthDetails ArticlePubMed