BDBM50320288 (3aR,5beta,6aS)-5-(2-((S)-2-cyanopyrrolidin-1-yl)-2-oxoethylamino)-N-pentylhexahydrocyclopenta[c]pyrrole-2(1H)-carboxamide::CHEMBL1082708
SMILES O=C(CN[C@H]1C[C@H]2CN(C[C@H]2C1)C(=O)N1CCCCC1)N1CCC[C@H]1C#N
InChI Key InChIKey=LTEVBEYLVWEGPJ-MHORFTMASA-N
Data  1 IC50
  Tab Delimited (TSV)   2D SDfile   Computed 3D by Vconf -m prep SDfile
Find this compound or compounds like it in BindingDB:
Activity Spreadsheet -- Enzyme Inhibition Constant Data from BindingDB
Found 1 hit for monomerid = 50320288
TargetDipeptidyl peptidase 4(Homo sapiens (Human))
Shanghai Hengrui Pharmaceuticals
Curated by ChEMBL
LigandPNGBDBM50320288((3aR,5beta,6aS)-5-(2-((S)-2-cyanopyrrolidin-1-yl)-...)
Affinity DataIC50:  69nM. Assay description: Inhibition of DPP4
In DepthDetails ArticlePubMed