BDBM50320291 (S)-1-(2-((3aR,5beta,6aS)-2-(2-hydroxyacetyl)octahydrocyclopenta[c]pyrrol-5-ylamino)acetyl)pyrrolidine-2-carbonitrile::CHEMBL1083032
SMILES OCC(=O)N1C[C@@H]2C[C@@H](C[C@@H]2C1)NCC(=O)N1CCC[C@H]1C#N
InChI Key InChIKey=HNJOMWLWAYUTSX-CRWXNKLISA-N
Data  1 IC50
  Tab Delimited (TSV)   2D SDfile   Computed 3D by Vconf -m prep SDfile
Find this compound or compounds like it in BindingDB:
Activity Spreadsheet -- Enzyme Inhibition Constant Data from BindingDB
Found 1 hit for monomerid = 50320291
TargetDipeptidyl peptidase 4(Homo sapiens (Human))
Shanghai Hengrui Pharmaceuticals
Curated by ChEMBL
LigandPNGBDBM50320291((S)-1-(2-((3aR,5beta,6aS)-2-(2-hydroxyacetyl)octah...)
Affinity DataIC50:  14nM. Assay description: Inhibition of DPP4
In DepthDetails ArticlePubMed