BDBM50320332 8-(3-methylbut-2-enyl)-2H-chromen-2-one::CHEMBL1084286
SMILES [#6]\[#6](-[#6])=[#6]\[#6]-c1cccc2ccc(=O)oc12
InChI Key InChIKey=RHJOYYPAYHHSMS-UHFFFAOYSA-N
Data  1 IC50
  Tab Delimited (TSV)   2D SDfile   Computed 3D by Vconf -m prep SDfile
Find this compound or compounds like it in BindingDB:
Activity Spreadsheet -- Enzyme Inhibition Constant Data from BindingDB
Found 1 hit for monomerid = 50320332
TargetExportin-1(Homo sapiens (Human))
Osaka University
Curated by ChEMBL
LigandPNGBDBM50320332(8-(3-methylbut-2-enyl)-2H-chromen-2-one | CHEMBL10...)
Affinity DataIC50:  6.40E+3nM. Assay description: Inhibition of CRM1-mediated hemagglutinin-tagged HIV1 Rev protein nuclear export in human HeLa cells assessed as nucleus localization after 12 hrs by...
In DepthDetails ArticlePubMed