BDBM50320495 5-[4-(4-tert-butylbenzyloxy)-3-nitrophenyl]isoxazole-3-carboxylicacid::CHEMBL1163781
SMILES CC(C)(C)c1ccc(COc2ccc(cc2[N+]([O-])=O)-c2cc([n-][o+]2)C(O)=O)cc1
InChI Key InChIKey=VQOQDYLJULXJJF-UHFFFAOYSA-N
Data  1 IC50
  Tab Delimited (TSV)   2D SDfile   Computed 3D by Vconf -m prep SDfile
Find this compound or compounds like it in BindingDB:
Activity Spreadsheet -- Enzyme Inhibition Constant Data from BindingDB
Found 1 hit for monomerid = 50320495
TargetXanthine dehydrogenase/oxidase(Bos taurus (Bovine))
Shenyang Pharmaceutical University
Curated by ChEMBL
LigandPNGBDBM50320495(5-[4-(4-tert-butylbenzyloxy)-3-nitrophenyl]isoxazo...)
Affinity DataIC50:  1.28E+4nM. Assay description: Inhibition of bovine xanthine oxidase by spectrophotometry
In DepthDetails ArticlePubMed