BDBM50320624 2-((2-(4-(benzylamino)-6-morpholino-1,3,5-triazin-2-yl)hydrazono)methyl)-4,6-diiodophenol::CHEMBL1163658
SMILES Oc1c(I)cc(I)cc1CN=Nc1nc(NCc2ccccc2)nc(n1)N1CCOCC1
InChI Key InChIKey=MQGGIEZPCBHDKW-UHFFFAOYSA-N
Data  1 IC50
  Tab Delimited (TSV)   2D SDfile   Computed 3D by Vconf -m prep SDfile
Find this compound or compounds like it in BindingDB:
Activity Spreadsheet -- Enzyme Inhibition Constant Data from BindingDB
Found 1 hit for monomerid = 50320624
TargetBeta-secretase 1(Homo sapiens (Human))
Applied Science University
Curated by ChEMBL
LigandPNGBDBM50320624(2-((2-(4-(benzylamino)-6-morpholino-1,3,5-triazin-...)
Affinity DataIC50:  1.00E+5nM. Assay description: Inhibition of BACE1 after 2 hrs by FRET assay
In DepthDetails ArticlePubMed