BDBM50320819 CHEMBL1163808::N-(4-(3-(1-amino-2-methylpropan-2-ylcarbamoyl)phenyl)-3-cyano-6-(2-hydroxyphenyl)pyridin-2-yl)-2-methoxybenzamide
SMILES COc1ccccc1C(=O)Nc1nc(cc(-c2cccc(c2)C(=O)NC(C)(C)CN)c1C#N)-c1ccccc1O
InChI Key InChIKey=BPMGVPIXHROSEM-UHFFFAOYSA-N
Data  1 IC50
  Tab Delimited (TSV)   2D SDfile   Computed 3D by Vconf -m prep SDfile
Find this compound or compounds like it in BindingDB:
Activity Spreadsheet -- Enzyme Inhibition Constant Data from BindingDB
Found 1 hit for monomerid = 50320819
TargetKiSS-1 receptor(Homo sapiens (Human))
Takeda Pharmaceutical
Curated by ChEMBL
LigandPNGBDBM50320819(CHEMBL1163808 | N-(4-(3-(1-amino-2-methylpropan-2-...)
Affinity DataIC50:  32nM. Assay description: Displacement of [125I]metastin(40-54) from human GPR54 receptor expressed in CHO cells after 60 mins by scintillation counting
In DepthDetails ArticlePubMed