BDBM50321053 CHEMBL1163559::{4-[1-(5-Chloro-2-trifluoromethyl-benzyl)-1,2,3,4-tetrahydro-pyrido[2,3-b]pyrazin-7-yl]-phenyl}-(4-pyrrolidin-1-ylpiperidin-1-yl)-methanone
SMILES FC(F)(F)c1ccc(Cl)cc1CN1CCNc2ncc(cc12)-c1ccc(cc1)C(=O)N1CCC(CC1)N1CCCC1
InChI Key InChIKey=JVVGHVJDZJSKRA-UHFFFAOYSA-N
Data  2 IC50
  Tab Delimited (TSV)   2D SDfile   Computed 3D by Vconf -m prep SDfile
Find this compound or compounds like it in BindingDB:
Activity Spreadsheet -- Enzyme Inhibition Constant Data from BindingDB
Found 2 hits for monomerid = 50321053
TargetALK tyrosine kinase receptor(Homo sapiens (Human))
Cephalon
Curated by ChEMBL
LigandPNGBDBM50321053(CHEMBL1163559 | {4-[1-(5-Chloro-2-trifluoromethyl-...)
Affinity DataIC50:  10nM. Assay description: Inhibition of ALK by time-resolved fluorescence assay
In DepthDetails ArticlePubMed
TargetALK tyrosine kinase receptor(Homo sapiens (Human))
Cephalon
Curated by ChEMBL
LigandPNGBDBM50321053(CHEMBL1163559 | {4-[1-(5-Chloro-2-trifluoromethyl-...)
Affinity DataIC50:  250nM. Assay description: Inhibition of ALK phosphorylation in human Karpas-299 cells by immunoblotting and ELISA
In DepthDetails ArticlePubMed