BDBM50321107 CHEMBL1165259::FPYVAE
SMILES CC(C)[C@H](NC(=O)[C@H](Cc1ccc(O)cc1)NC(=O)[C@@H]1CCCN1C(=O)[C@@H](N)Cc1ccccc1)C(=O)N[C@@H](C)C(=O)N[C@@H](CCC(O)=O)C(O)=O
InChI Key InChIKey=QKSOHTFYHNYHRK-YFVDCHTDSA-N
Data  1 IC50
  Tab Delimited (TSV)   2D SDfile   Computed 3D by Vconf -m prep SDfile
Find this compound or compounds like it in BindingDB:
Activity Spreadsheet -- Enzyme Inhibition Constant Data from BindingDB
Found 1 hit for monomerid = 50321107
Target3-hydroxy-3-methylglutaryl-coenzyme A reductase(Homo sapiens (Human))
Institute Of The Chemistry Of Plant Substances
Curated by ChEMBL
LigandPNGBDBM50321107(CHEMBL1165259 | FPYVAE)
Affinity DataIC50:  1.47E+3nM. Assay description: Inhibition of HMG-CoA reductase by spectrophotometry
In DepthDetails ArticlePubMed