BDBM50321330 CHEMBL4166624
SMILES Nc1oncc1-n1cc(F)cn1
InChI Key InChIKey=YCBKZPFCIBXKIG-UHFFFAOYSA-N
Data  6 IC50  2 EC50
  Tab Delimited (TSV)   2D SDfile   Computed 3D by Vconf -m prep SDfile
Find this compound or compounds like it in BindingDB:
Activity Spreadsheet -- Enzyme Inhibition Constant Data from BindingDB
Found 8 hits for monomerid = 50321330
TargetCytochrome P450 2D6(Homo sapiens (Human))
Genentech
Curated by ChEMBL
LigandPNGBDBM50321330(CHEMBL4166624)
Affinity DataIC50: >1.00E+4nM. Assay description: Inhibition of CYP2D6 (unknown origin)
In DepthDetails ArticlePubMed
TargetCytochrome P450 2C9(Homo sapiens (Human))
Genentech
Curated by ChEMBL
LigandPNGBDBM50321330(CHEMBL4166624)
Affinity DataIC50: >1.00E+4nM. Assay description: Inhibition of CYP2C9 (unknown origin)
In DepthDetails ArticlePubMed
TargetCytochrome P450 2C19(Homo sapiens (Human))
Genentech
Curated by ChEMBL
LigandPNGBDBM50321330(CHEMBL4166624)
Affinity DataIC50: >1.00E+4nM. Assay description: Inhibition of CYP2C19 (unknown origin)
In DepthDetails ArticlePubMed
TargetTryptophan 2,3-dioxygenase(Homo sapiens (Human))
Xihua University
Curated by ChEMBL
LigandPNGBDBM50321330(CHEMBL4166624)
Affinity DataEC50:  77nM. Assay description: Inhibition of TDO (unknown origin)
In DepthDetails ArticlePubMed
TargetTryptophan 2,3-dioxygenase(Homo sapiens (Human))
Xihua University
Curated by ChEMBL
LigandPNGBDBM50321330(CHEMBL4166624)
Affinity DataIC50:  340nM. Assay description: Inhibition of recombinant human TDO2 assessed as decrease in conversion of L-tryptophan to N-formylkynurenine preincubated for 5 mins followed by 0.2...
In DepthDetails ArticlePubMed
TargetCytochrome P450 3A4(Homo sapiens (Human))
Genentech
Curated by ChEMBL
LigandPNGBDBM50321330(CHEMBL4166624)
Affinity DataIC50: >1.00E+4nM. Assay description: Inhibition of CYP3A4 (unknown origin)
In DepthDetails ArticlePubMed
TargetCytochrome P450 1A2(Homo sapiens (Human))
Genentech
Curated by ChEMBL
LigandPNGBDBM50321330(CHEMBL4166624)
Affinity DataIC50: >1.00E+4nM. Assay description: Inhibition of CYP1A2 (unknown origin)
In DepthDetails ArticlePubMed
TargetTryptophan 2,3-dioxygenase(Homo sapiens (Human))
Xihua University
Curated by ChEMBL
LigandPNGBDBM50321330(CHEMBL4166624)
Affinity DataEC50:  77nM. Assay description: Inhibition of TDO2 in human SW48 cells assessed as decrease in conversion of tryptophan to N-formylkynurenine after 30 mins by fluorescence assay
In DepthDetails ArticlePubMed