BDBM50321362 4-cyano-N-(3-cyclohexenylbiphenyl-4-yl)-1H-imidazole-2-carboxamide::CHEMBL1171776
SMILES O=C(Nc1ccc(cc1C1=CCCCC1)-c1ccccc1)c1ncc([nH]1)C#N
InChI Key InChIKey=AWFIHKUWCIHUJW-UHFFFAOYSA-N
Data  1 IC50
  Tab Delimited (TSV)   2D SDfile   Computed 3D by Vconf -m prep SDfile
Find this compound or compounds like it in BindingDB:
Activity Spreadsheet -- Enzyme Inhibition Constant Data from BindingDB
Found 1 hit for monomerid = 50321362
TargetMacrophage colony-stimulating factor 1 receptor(Homo sapiens (Human))
Johnson & Johnson Pharmaceutical Research & Development
Curated by ChEMBL
LigandPNGBDBM50321362(4-cyano-N-(3-cyclohexenylbiphenyl-4-yl)-1H-imidazo...)
Affinity DataIC50: >60nM. Assay description: Inhibition of human FMS by fluorescence polarization
In DepthDetails ArticlePubMed