BDBM50321426 3-(benzo[d]oxazol-2-yl)-N-methyl-5-(1-(piperidin-4-yl)-1H-pyrazol-4-yl)pyridin-2-amine tetrahydrochloride::CHEMBL1172707
SMILES CNc1ncc(cc1-c1nc2ccccc2o1)-c1cnn(c1)C1CCNCC1
InChI Key InChIKey=ZJLJNEZUECVDBB-UHFFFAOYSA-N
Data  1 IC50
  Tab Delimited (TSV)   2D SDfile   Computed 3D by Vconf -m prep SDfile
Find this compound or compounds like it in BindingDB:
Activity Spreadsheet -- Enzyme Inhibition Constant Data from BindingDB
Found 1 hit for monomerid = 50321426
TargetHepatocyte growth factor receptor(Homo sapiens (Human))
Korea Research Institute Of Chemical Technology
Curated by ChEMBL
LigandPNGBDBM50321426(3-(benzo[d]oxazol-2-yl)-N-methyl-5-(1-(piperidin-4...)
Affinity DataIC50: >1.00E+4nM. Assay description: Inhibition of recombinant c-MET by HTRF assay
In DepthDetails ArticlePubMed