BDBM50321439 CHEMBL1172128::N,N'-(2,4,6-trimethyl-1,3-phenylene)bis(4-bromobenzenesulfonamide)
SMILES Cc1cc(C)c(NS(=O)(=O)c2ccc(Br)cc2)c(C)c1NS(=O)(=O)c1ccc(Br)cc1
InChI Key InChIKey=YBGHXXBGQNLURM-UHFFFAOYSA-N
Data  1 IC50
  Tab Delimited (TSV)   2D SDfile   Computed 3D by Vconf -m prep SDfile
Find this compound or compounds like it in BindingDB:
Activity Spreadsheet -- Enzyme Inhibition Constant Data from BindingDB
Found 1 hit for monomerid = 50321439
TargetMO15-related protein kinase Pfmrk(Plasmodium falciparum)
Walter Reed Army Institute Of Research
Curated by ChEMBL
LigandPNGBDBM50321439(CHEMBL1172128 | N,N'-(2,4,6-trimethyl-1,3-phenylen...)
Affinity DataIC50:  5.02E+4nM. Assay description: Inhibition of His6x-tagged Plasmodium falciparum Pfmrk expressed in Escherichia coli by microtiter plate scintillation counting
In DepthDetails ArticlePubMed