BDBM50321582 1-(3-aminopropyl)-8-(3-(2-(dimethylamino)-2-oxoethyl)phenylamino)-N-((2-methylpyridin-4-yl)methyl)-4,5-dihydro-1H-pyrazolo[4,3-h]quinazoline-3-carboxamide::CHEMBL1172241
SMILES CN(C)C(=O)Cc1cccc(Nc2ncc3CCc4c(nn(CCCN)c4-c3n2)C(=O)NCc2ccnc(C)c2)c1
InChI Key InChIKey=VVKMHTWFAUCCOD-UHFFFAOYSA-N
Data  3 IC50
  Tab Delimited (TSV)   2D SDfile   Computed 3D by Vconf -m prep SDfile
Find this compound or compounds like it in BindingDB:
Activity Spreadsheet -- Enzyme Inhibition Constant Data from BindingDB
Found 3 hits for monomerid = 50321582
Target3-phosphoinositide-dependent protein kinase 1(Homo sapiens (Human))
Pfizer
Curated by ChEMBL
LigandPNGBDBM50321582(1-(3-aminopropyl)-8-(3-(2-(dimethylamino)-2-oxoeth...)
Affinity DataIC50:  85nM. Assay description: Inhibition of PDK1-mediated AKT1 phosphorylation at T308 in human H460 cells after 2 hrs by ELISA
In DepthDetails ArticlePubMed
Target3-phosphoinositide-dependent protein kinase 1(Homo sapiens (Human))
Pfizer
Curated by ChEMBL
LigandPNGBDBM50321582(1-(3-aminopropyl)-8-(3-(2-(dimethylamino)-2-oxoeth...)
Affinity DataIC50:  85nM. Assay description: Inhibition of PDK1
In DepthDetails ArticlePubMed
TargetCyclin-dependent kinase 2(Homo sapiens (Human))
Nerviano Medical Sciences
Curated by ChEMBL
LigandPNGBDBM50321582(1-(3-aminopropyl)-8-(3-(2-(dimethylamino)-2-oxoeth...)
Affinity DataIC50:  500nM. Assay description: Inhibition of CDK2
In DepthDetails ArticlePubMed