BDBM50321641 1-(3-chloro-5-(5-fluoro-4-(4-fluoro-3-(trifluoromethoxy)phenyl)thiazol-2-ylcarbamoyl)pyridin-2-yl)piperidine-4-carboxylic acid::CHEMBL1170600
SMILES OC(=O)C1CCN(CC1)c1ncc(cc1Cl)C(=O)Nc1nc(c(F)s1)-c1ccc(F)c(OC(F)(F)F)c1
InChI Key InChIKey=PGZXOQNIRPPTTO-UHFFFAOYSA-N
Data  1 EC50
  Tab Delimited (TSV)   2D SDfile   Computed 3D by Vconf -m prep SDfile
Find this compound or compounds like it in BindingDB:
Activity Spreadsheet -- Enzyme Inhibition Constant Data from BindingDB
Found 1 hit for monomerid = 50321641
TargetThrombopoietin receptor(Homo sapiens (Human))
Pfizer
Curated by ChEMBL
LigandPNGBDBM50321641(1-(3-chloro-5-(5-fluoro-4-(4-fluoro-3-(trifluorome...)
Affinity DataEC50:  620nM. Assay description: Agonist activity at human TPO receptor expressed in rat BaF3 cells
In DepthDetails ArticlePubMed