BDBM50321957 CHEMBL1172708::N-(4-Bromophenyl)-2-(piperazin-1-yl)-9H-purin-6-amine
SMILES Brc1ccc(Nc2nc(nc3nc[nH]c23)N2CCNCC2)cc1
InChI Key InChIKey=IVYXADBEDBLONB-UHFFFAOYSA-N
Data  1 IC50
  Tab Delimited (TSV)   2D SDfile   Computed 3D by Vconf -m prep SDfile
Find this compound or compounds like it in BindingDB:
Activity Spreadsheet -- Enzyme Inhibition Constant Data from BindingDB
Found 1 hit for monomerid = 50321957
TargetProto-oncogene tyrosine-protein kinase Src(Homo sapiens (Human))
Chinese Academy Of Sciences
Curated by ChEMBL
LigandPNGBDBM50321957(CHEMBL1172708 | N-(4-Bromophenyl)-2-(piperazin-1-y...)
Affinity DataIC50:  1.76E+3nM. Assay description: Inhibition cSRC
In DepthDetails ArticlePubMed