BDBM50322033 2-Methylisoindole-1,3-dione-5-yl 3-(6-aminopyridin-3-yl)propionate::CHEMBL1171655
SMILES CN1C(=O)c2ccc(OC(=O)CCc3ccc(N)nc3)cc2C1=O
InChI Key InChIKey=OSPQCZJJZMQHLM-UHFFFAOYSA-N
Data  1 KI  3 IC50
  Tab Delimited (TSV)   2D SDfile   Computed 3D by Vconf -m prep SDfile
Find this compound or compounds like it in BindingDB:
Activity Spreadsheet -- Enzyme Inhibition Constant Data from BindingDB
Found 4 hits for monomerid = 50322033
TargetProthrombin(Bos taurus (Bovine))
The University Of Tokyo
Curated by ChEMBL
LigandPNGBDBM50322033(2-Methylisoindole-1,3-dione-5-yl 3-(6-aminopyridin...)
Affinity DataKi:  7.00E+3nM. Assay description: Binding affinity to bovine thrombin after 3 mins
In DepthDetails ArticlePubMed
TargetTrypsin(Homo sapiens (Human))
Tokyo University Of Pharmacy And Life Sciences
Curated by ChEMBL
LigandPNGBDBM50322033(2-Methylisoindole-1,3-dione-5-yl 3-(6-aminopyridin...)
Affinity DataIC50:  1.20E+3nM. Assay description: Inhibition of trypsin (unknown origin) using Bz-Arg-pNA.HCl as substrate after 5 mins by colorimetric analysis
In DepthDetails ArticlePubMed
TargetTryptase beta-2/delta/gamma(Homo sapiens (Human))
Tokyo University Of Pharmacy And Life Sciences
Curated by ChEMBL
LigandPNGBDBM50322033(2-Methylisoindole-1,3-dione-5-yl 3-(6-aminopyridin...)
Affinity DataIC50:  190nM. Assay description: Inhibition of tryptase (unknown origin) using t-Boc-Phe-Ser-Arg-MCA as substrate after 5 mins by fluorimetric analysis
In DepthDetails ArticlePubMed
TargetProthrombin(Homo sapiens (Human))
Tokyo University Of Pharmacy And Life Sciences
Curated by ChEMBL
LigandPNGBDBM50322033(2-Methylisoindole-1,3-dione-5-yl 3-(6-aminopyridin...)
Affinity DataIC50:  5.30E+3nM. Assay description: Inhibition of thrombin (unknown origin) using t-Boc-Val-Pro-Arg-MCA as substrate after 5 mins by fluorimetric analysis
In DepthDetails ArticlePubMed