BDBM50322082 CHEMBL1173503::N-benzyl-3-(4-bromophenylsulfonyl)-N-methylthieno[2,3-e][1,2,3]triazolo[1,5-a]pyrimidin-5-amine
SMILES CN(Cc1ccccc1)c1nc2c(nnn2c2ccsc12)S(=O)(=O)c1ccc(Br)cc1
InChI Key InChIKey=GSZPCKPHPBULTR-UHFFFAOYSA-N
Data  1 IC50
  Tab Delimited (TSV)   2D SDfile   Computed 3D by Vconf -m prep SDfile
Find this compound or compounds like it in BindingDB:
Activity Spreadsheet -- Enzyme Inhibition Constant Data from BindingDB
Found 1 hit for monomerid = 50322082
Target5-hydroxytryptamine receptor 6(Homo sapiens (Human))
Chemical Diversity Research Institute
Curated by ChEMBL
LigandPNGBDBM50322082(CHEMBL1173503 | N-benzyl-3-(4-bromophenylsulfonyl)...)
Affinity DataIC50:  1.95E+3nM. Assay description: Antagonist activity at human recombinant 5HT6 receptor expressed in HEK293 cells assessed as inhibition of serotonin-induced cAMP production
In DepthDetails ArticlePubMed