BDBM50322134 3-(4-isopropylphenylsulfonyl)-N-(3-methoxyphenyl)thieno[2,3-e][1,2,3]triazolo[1,5-a]pyrimidin-5-amine::CHEMBL1170288
SMILES COc1cccc(Nc2nc3c(nnn3c3ccsc23)S(=O)(=O)c2ccc(cc2)C(C)C)c1
InChI Key InChIKey=QQRYJPQWFTYNDK-UHFFFAOYSA-N
Data  1 IC50
  Tab Delimited (TSV)   2D SDfile   Computed 3D by Vconf -m prep SDfile
Find this compound or compounds like it in BindingDB:
Activity Spreadsheet -- Enzyme Inhibition Constant Data from BindingDB
Found 1 hit for monomerid = 50322134
Target5-hydroxytryptamine receptor 6(Homo sapiens (Human))
Chemical Diversity Research Institute
Curated by ChEMBL
LigandPNGBDBM50322134(3-(4-isopropylphenylsulfonyl)-N-(3-methoxyphenyl)t...)
Affinity DataIC50:  900nM. Assay description: Antagonist activity at human recombinant 5HT6 receptor expressed in HEK293 cells assessed as inhibition of serotonin-induced cAMP production
In DepthDetails ArticlePubMed