BDBM50322218 CHEMBL1172596::N-(4-fluorobenzyl)-3-(phenylsulfonyl)thieno[2,3-e][1,2,3]triazolo[1,5-a]pyrimidin-5-amine
SMILES Fc1ccc(CNc2nc3c(nnn3c3ccsc23)S(=O)(=O)c2ccccc2)cc1
InChI Key InChIKey=RGVLGMALJYCMFT-UHFFFAOYSA-N
Data  1 IC50
  Tab Delimited (TSV)   2D SDfile   Computed 3D by Vconf -m prep SDfile
Find this compound or compounds like it in BindingDB:
Activity Spreadsheet -- Enzyme Inhibition Constant Data from BindingDB
Found 1 hit for monomerid = 50322218
Target5-hydroxytryptamine receptor 6(Homo sapiens (Human))
Chemical Diversity Research Institute
Curated by ChEMBL
LigandPNGBDBM50322218(CHEMBL1172596 | N-(4-fluorobenzyl)-3-(phenylsulfon...)
Affinity DataIC50:  690nM. Assay description: Antagonist activity at human recombinant 5HT6 receptor expressed in HEK293 cells assessed as inhibition of serotonin-induced cAMP production
In DepthDetails ArticlePubMed