BDBM50322275 (3S)-1-Butyl-3-(cyclohexylmethyl)-9-[(5-methyl-2-phenyl-1,3-oxazol-4-yl)methyl]-1,4,9-triazaspiro[5.5]undecane-2,5-dione hydrochloride::CHEMBL1173645
SMILES CCCCN1C(=O)[C@H](CC2CCCCC2)NC(=O)C11CCN(Cc2nc(oc2C)-c2ccccc2)CC1
InChI Key InChIKey=QKBRYPYIOKWOEV-VWLOTQADSA-N
Data  1 IC50
  Tab Delimited (TSV)   2D SDfile   Computed 3D by Vconf -m prep SDfile
Find this compound or compounds like it in BindingDB:
Activity Spreadsheet -- Enzyme Inhibition Constant Data from BindingDB
Found 1 hit for monomerid = 50322275
TargetC-C chemokine receptor type 5(Homo sapiens (Human))
Minase Research Institute
Curated by ChEMBL
LigandPNGBDBM50322275((3S)-1-Butyl-3-(cyclohexylmethyl)-9-[(5-methyl-2-p...)
Affinity DataIC50:  450nM. Assay description: Antagonist activity at human CCR5 receptor expressed in CHO cells assessed as inhibition of MIP-1-alpha-stmulated calcium mobilization
In DepthDetails ArticlePubMed