BDBM50322306 CHEMBL1173512::N-[3-Cyano-4-{3-[(4-ethylpiperazin-1-yl)methyl]phenyl}-6-(4-fluoro-2-hydroxyphenyl)pyridin-2-yl]furan-2-carboxamide
SMILES CCN1CCN(Cc2cccc(c2)-c2cc(nc(NC(=O)c3ccco3)c2C#N)-c2ccc(F)cc2O)CC1
InChI Key InChIKey=JLOUFXQEQKGJOU-UHFFFAOYSA-N
Data  1 IC50
  Tab Delimited (TSV)   2D SDfile   Computed 3D by Vconf -m prep SDfile
Find this compound or compounds like it in BindingDB:
Activity Spreadsheet -- Enzyme Inhibition Constant Data from BindingDB
Found 1 hit for monomerid = 50322306
TargetKiSS-1 receptor(Homo sapiens (Human))
Takeda Pharmaceutical
Curated by ChEMBL
LigandPNGBDBM50322306(CHEMBL1173512 | N-[3-Cyano-4-{3-[(4-ethylpiperazin...)
Affinity DataIC50:  20nM. Assay description: Displacement of [125I]metastin from human GPR54 receptor expressed in CHO cells
In DepthDetails ArticlePubMed