BDBM50322401 (S)-N-((3-amino-1-(5-ethyl-7H-pyrrolo[2,3-d]pyrimidin-4-yl)pyrrolidin-3-yl)methyl)-4-fluorobenzamide::CHEMBL1170261
SMILES CCc1c[nH]c2ncnc(N3CC[C@](N)(CNC(=O)c4ccc(F)cc4)C3)c12
InChI Key InChIKey=MACTYDWFDZZTGD-FQEVSTJZSA-N
Data  2 IC50
  Tab Delimited (TSV)   2D SDfile   Computed 3D by Vconf -m prep SDfile
Find this compound or compounds like it in BindingDB:
Activity Spreadsheet -- Enzyme Inhibition Constant Data from BindingDB
Found 2 hits for monomerid = 50322401
TargetRAC-alpha serine/threonine-protein kinase(Homo sapiens (Human))
Pfizer
Curated by ChEMBL
LigandPNGBDBM50322401((S)-N-((3-amino-1-(5-ethyl-7H-pyrrolo[2,3-d]pyrimi...)
Affinity DataIC50:  650nM. Assay description: Inhibition of AKT1-mediated GSK3alpha phosphorylation in human U87 cells after 1 hr by ELISA
In DepthDetails ArticlePubMed
TargetRAC-alpha serine/threonine-protein kinase(Homo sapiens (Human))
Pfizer
Curated by ChEMBL
LigandPNGBDBM50322401((S)-N-((3-amino-1-(5-ethyl-7H-pyrrolo[2,3-d]pyrimi...)
Affinity DataIC50:  1.40nM. Assay description: Inhibition of AKT1 after 90 mins by IMAP assay
In DepthDetails ArticlePubMed