BDBM50322491 3-((S)-5-(benzylperoxy)-4-((R)-4-((3R,5R,7R,8R,9S,10S,13R,14S,17R)-3,7-dihydroxy-10,13-dimethylhexadecahydro-1H-cyclopenta[a]phenanthren-17-yl)pentanamido)-5-oxopentanamido)benzoic acid::CHEMBL3138507
SMILES CC(CCC(=O)NC(CCC(=O)Nc1cccc(c1)C(O)=O)C(=O)OOCc1ccccc1)C1CCC2C3C(O)CC4CC(O)CCC4(C)C3CCC12C
InChI Key InChIKey=UVECCUOFVSIRQV-SULYVVQSSA-N
Data  1 KI
  Tab Delimited (TSV)   2D SDfile   Computed 3D by Vconf -m prep SDfile
Find this compound or compounds like it in BindingDB:
Activity Spreadsheet -- Enzyme Inhibition Constant Data from BindingDB
Found 1 hit for monomerid = 50322491
TargetIleal sodium/bile acid cotransporter(Homo sapiens (Human))
University Of Maryland
Curated by ChEMBL
LigandPNGBDBM50322491(3-((S)-5-(benzylperoxy)-4-((R)-4-((3R,5R,7R,8R,9S,...)
Affinity DataKi:  2.24E+3nM. Assay description: Inhibition of human ASBT expressed in MDCK cells assessed as inhibition of [3H]taurocholic acid uptake after 10 mins by liquid scintillation counting
In DepthDetails ArticlePubMed