BDBM50322540 CHEMBL1172586::N-[3-(1H-Imidazol-1-yl)-5-(trifluoromethyl)phenyl]-3-[2-(imidazo-[1,2-a]pyridin-3-yl)ethynyl]-4-methylbenzamide
SMILES Cc1ccc(cc1C#Cc1cnc2ccccn12)C(=O)Nc1cc(cc(c1)C(F)(F)F)-n1ccnc1
InChI Key InChIKey=SUHXJJURNJBVSU-UHFFFAOYSA-N
Data  1 IC50
  Tab Delimited (TSV)   2D SDfile   Computed 3D by Vconf -m prep SDfile
Find this compound or compounds like it in BindingDB:
Activity Spreadsheet -- Enzyme Inhibition Constant Data from BindingDB
Found 1 hit for monomerid = 50322540
TargetTyrosine-protein kinase ABL1(Homo sapiens (Human))
Ariad Pharmaceuticals
Curated by ChEMBL
LigandPNGBDBM50322540(CHEMBL1172586 | N-[3-(1H-Imidazol-1-yl)-5-(trifluo...)
Affinity DataIC50:  26nM. Assay description: Inhibition of wild type human ABL after 1 hr by TR-FRET assay
In DepthDetails ArticlePubMed