BDBM50322671 2'-(6-oxo-6H-benzo[c]chromen-3-ylcarbamoyl)biphenyl-2-carboxylic acid::CHEMBL1173036
SMILES OC(=O)c1ccccc1-c1ccccc1C(=O)Nc1ccc2c(c1)oc(=O)c1ccccc21
InChI Key InChIKey=KWLDLJHPVBNVLM-UHFFFAOYSA-N
Data  1 IC50
  Tab Delimited (TSV)   2D SDfile   Computed 3D by Vconf -m prep SDfile
Find this compound or compounds like it in BindingDB:
Activity Spreadsheet -- Enzyme Inhibition Constant Data from BindingDB
Found 1 hit for monomerid = 50322671
TargetUDP-glucose 4-epimerase(Trypanosoma brucei)
University Of California San Diego
Curated by ChEMBL
LigandPNGBDBM50322671(2'-(6-oxo-6H-benzo[c]chromen-3-ylcarbamoyl)bipheny...)
Affinity DataIC50:  3.20E+3nM. Assay description: Inhibition of hexahistidine-tagged Trypanosoma brucei UDP-galactose-4'epimerase expressed in Escherichia coli
In DepthDetails ArticlePubMed