BDBM50322830 CHEMBL1210175::N,8-diphenyl-9H-purin-6-amine
SMILES N(c1ccccc1)c1ncnc2nc([nH]c12)-c1ccccc1
InChI Key InChIKey=OKZNIBWRMMFNQY-UHFFFAOYSA-N
Data  1 IC50
  Tab Delimited (TSV)   2D SDfile   Computed 3D by Vconf -m prep SDfile
Find this compound or compounds like it in BindingDB:
Activity Spreadsheet -- Enzyme Inhibition Constant Data from BindingDB
Found 1 hit for monomerid = 50322830
TargetGlycogen synthase kinase-3 beta(Homo sapiens (Human))
Institut Curie
Curated by ChEMBL
LigandPNGBDBM50322830(CHEMBL1210175 | N,8-diphenyl-9H-purin-6-amine)
Affinity DataIC50:  16nM. Assay description: Inhibition of human GSK3beta
In DepthDetails ArticlePubMed