BDBM50323265 CHEMBL1208847::N-(4-(4-cyano-1H-imidazo[4,5-c]pyridin-6-yl)-2-(trifluoromethyl)phenyl)acetamide
SMILES CC(=O)Nc1ccc(cc1C(F)(F)F)-c1cc2nc[nH]c2c(n1)C#N
InChI Key InChIKey=RTYPDZWNEFAGDW-UHFFFAOYSA-N
Data  2 IC50
  Tab Delimited (TSV)   2D SDfile   Computed 3D by Vconf -m prep SDfile
Find this compound or compounds like it in BindingDB:
Activity Spreadsheet -- Enzyme Inhibition Constant Data from BindingDB
Found 2 hits for monomerid = 50323265
TargetCathepsin S(Homo sapiens (Human))
Merck Research Laboratories
Curated by ChEMBL
LigandPNGBDBM50323265(CHEMBL1208847 | N-(4-(4-cyano-1H-imidazo[4,5-c]pyr...)
Affinity DataIC50:  3.24E+3nM. Assay description: Inhibition of human cathepsin S by fluorescence assay
In DepthDetails ArticlePubMed
TargetCathepsin K(Homo sapiens (Human))
Merck Research Laboratories
Curated by ChEMBL
LigandPNGBDBM50323265(CHEMBL1208847 | N-(4-(4-cyano-1H-imidazo[4,5-c]pyr...)
Affinity DataIC50: >1.00E+4nM. Assay description: Inhibition of human cathepsin K by fluorescence assay
In DepthDetails ArticlePubMed