BDBM50323346 CHEMBL1209556::rac-4-Isobutyl-6-(4-trifluoromethyl-benzyl)-6,7-dihydro-5-thia-2,3a,6-triaza-indene 5,5-dioxide
SMILES CC(C)CC1n2cncc2CN(Cc2ccc(cc2)C(F)(F)F)S1(=O)=O
InChI Key InChIKey=CGIWGBIOKQVESP-UHFFFAOYSA-N
Data  3 IC50
  Tab Delimited (TSV)   2D SDfile   Computed 3D by Vconf -m prep SDfile
Find this compound or compounds like it in BindingDB:
Activity Spreadsheet -- Enzyme Inhibition Constant Data from BindingDB
Found 3 hits for monomerid = 50323346
TargetCytochrome P450 11B2, mitochondrial(Homo sapiens (Human))
Novartis Institutes For Biomedical Research
Curated by ChEMBL
LigandPNGBDBM50323346(CHEMBL1209556 | rac-4-Isobutyl-6-(4-trifluoromethy...)
Affinity DataIC50:  121nM. Assay description: Inhibition of human recombinant CYP11B2 by cell-based assay
In DepthDetails ArticlePubMed
TargetCytochrome P450 3A4(Homo sapiens (Human))
Novartis Institutes For Biomedical Research
Curated by ChEMBL
LigandPNGBDBM50323346(CHEMBL1209556 | rac-4-Isobutyl-6-(4-trifluoromethy...)
Affinity DataIC50:  280nM. Assay description: Inhibition of human CYP3A4-mediated testosterone oxidation
In DepthDetails ArticlePubMed
TargetCytochrome P450 11B1, mitochondrial(Homo sapiens (Human))
Novartis Institutes For Biomedical Research
Curated by ChEMBL
LigandPNGBDBM50323346(CHEMBL1209556 | rac-4-Isobutyl-6-(4-trifluoromethy...)
Affinity DataIC50:  566nM. Assay description: Inhibition of human recombinant CYP11B1 by cell-based assay
In DepthDetails ArticlePubMed