BDBM50323661 CHEMBL1208952::N-(5-tert-butyl-3-cyano-2-methoxyphenyl)-2-oxo-2-(4-(pyridin-4-ylamino)naphthalen-1-yl)acetamide
SMILES COc1c(NC(=O)C(=O)c2ccc(Nc3ccncc3)c3ccccc23)cc(cc1C#N)C(C)(C)C
InChI Key InChIKey=LZIAGZLGKVTFMX-UHFFFAOYSA-N
Data  1 IC50
  Tab Delimited (TSV)   2D SDfile   Computed 3D by Vconf -m prep SDfile
Find this compound or compounds like it in BindingDB:
Activity Spreadsheet -- Enzyme Inhibition Constant Data from BindingDB
Found 1 hit for monomerid = 50323661
TargetMitogen-activated protein kinase 14(Homo sapiens (Human))
K£Mia
Curated by ChEMBL
LigandPNGBDBM50323661(CHEMBL1208952 | N-(5-tert-butyl-3-cyano-2-methoxyp...)
Affinity DataIC50:  51nM. Assay description: Inhibition of p38 alpha activity by ELISA
In DepthDetails ArticlePubMed