BDBM50323695 2-((5R,6R,7R,8S)-8-acetamido-6,7-dihydroxy-5-(hydroxymethyl)-5,6,7,8-tetrahydroimidazo[1,2-a]pyridin-2-yl)acetic acid::CHEMBL254346::gluco-nagstatin
SMILES CC(=O)N[C@@H]1[C@@H](O)[C@H](O)[C@@H](CO)n2cc(CC(O)=O)nc12
InChI Key InChIKey=XPJWMTPRJTUTBX-QCNRFFRDSA-N
Data  1 KI
  Tab Delimited (TSV)   2D SDfile   Computed 3D by Vconf -m prep SDfile
Find this compound or compounds like it in BindingDB:
Activity Spreadsheet -- Enzyme Inhibition Constant Data from BindingDB
Found 1 hit for monomerid = 50323695
TargetProtein O-GlcNAcase(Homo sapiens (Human))
Simon Fraser University
Curated by ChEMBL
LigandPNGBDBM50323695(2-((5R,6R,7R,8S)-8-acetamido-6,7-dihydroxy-5-(hydr...)
Affinity DataKi:  420nM. Assay description: Inhibition of human O-GlcNAcase
In DepthDetails ArticlePubMed