BDBM50323889 4-oxo-2-(4-phenoxyphenyl)-4H-chromene-8-carboxylic acid::CHEMBL1213844
SMILES OC(=O)c1cccc2c1oc(cc2=O)-c1ccc(Oc2ccccc2)cc1
InChI Key InChIKey=BIMVSKOKCKSLBJ-UHFFFAOYSA-N
Data  1 IC50
  Tab Delimited (TSV)   2D SDfile   Computed 3D by Vconf -m prep SDfile
Find this compound or compounds like it in BindingDB:
Activity Spreadsheet -- Enzyme Inhibition Constant Data from BindingDB
Found 1 hit for monomerid = 50323889
TargetCysteinyl leukotriene receptor 1(Homo sapiens (Human))
Zhejiang University
Curated by ChEMBL
LigandPNGBDBM50323889(4-oxo-2-(4-phenoxyphenyl)-4H-chromene-8-carboxylic...)
Affinity DataIC50:  5.50E+4nM. Assay description: Antagonist activity at CysLT1 receptor in human dU937 cells assessed as inhibition of LTD4-induced increase of calcium level treated 30 mins before L...
In DepthDetails ArticlePubMed