BDBM50323934 CHEMBL1214486::Orhalquinone
SMILES CC1=C2C(=O)C(=O)c3cc4C(=O)C=CC(=O)c4cc3C2(C)CCC1
InChI Key InChIKey=GNSUDOFOVBGTSU-UHFFFAOYSA-N
Data  1 IC50
  Tab Delimited (TSV)   2D SDfile   Computed 3D by Vconf -m prep SDfile
Find this compound or compounds like it in BindingDB:
Activity Spreadsheet -- Enzyme Inhibition Constant Data from BindingDB
Found 1 hit for monomerid = 50323934
TargetPhospholipase A2(Apis mellifera)
National Museum Of Natural History
Curated by ChEMBL
LigandPNGBDBM50323934(CHEMBL1214486 | Orhalquinone)
Affinity DataIC50:  1.57E+6nM. Assay description: Inhibition of bee venom phospholipase A2 after 5 mins by spectrophotometric analysis
In DepthDetails ArticlePubMed