BDBM50323941 (2S)-2-Amino-N-(1-(2-(3-chloro-4-fluorophenylamino)-2-oxoethyl)-2,6-dioxopiperidin-3-yl)-3-phenylpropanamide::CHEMBL1214591
SMILES N[C@@H](Cc1ccccc1)C(=O)N[C@H]1CCC(=O)N(CC(=O)Nc2ccc(F)c(Cl)c2)C1=O
InChI Key InChIKey=FWHRTJQKPZGSSY-ROUUACIJSA-N
Data  2 IC50
  Tab Delimited (TSV)   2D SDfile   Computed 3D by Vconf -m prep SDfile
Find this compound or compounds like it in BindingDB:
Activity Spreadsheet -- Enzyme Inhibition Constant Data from BindingDB
Found 2 hits for monomerid = 50323941
Target72 kDa type IV collagenase(Homo sapiens (Human))
Shandong University
Curated by ChEMBL
LigandPNGBDBM50323941((2S)-2-Amino-N-(1-(2-(3-chloro-4-fluorophenylamino...)
Affinity DataIC50:  1.31E+5nM. Assay description: Inhibition of MMP2 after 30 mins
In DepthDetails ArticlePubMed
TargetAminopeptidase N(Sus scrofa (Pig))
Shandong University
Curated by ChEMBL
LigandPNGBDBM50323941((2S)-2-Amino-N-(1-(2-(3-chloro-4-fluorophenylamino...)
Affinity DataIC50:  1.70E+5nM. Assay description: Inhibition of pig kidney microsome aminopeptidase N after 30 mins by UV-vis spectrophotometric analysis
In DepthDetails ArticlePubMed