BDBM50324042 4'-[(5,6-Dibromo-2-propyl-1H-benzo[d]imidazol-1-yl)-methyl]-biphenyl-2-carboxylic acid::CHEMBL1214824
SMILES CCCc1nc2cc(Br)c(Br)cc2n1Cc1ccc(cc1)-c1ccccc1C(O)=O
InChI Key InChIKey=SKIFXVZAZPTMPN-UHFFFAOYSA-N
Data  1 EC50
  Tab Delimited (TSV)   2D SDfile   Computed 3D by Vconf -m prep SDfile
Find this compound or compounds like it in BindingDB:
Activity Spreadsheet -- Enzyme Inhibition Constant Data from BindingDB
Found 1 hit for monomerid = 50324042
TargetPeroxisome proliferator-activated receptor gamma(Homo sapiens (Human))
Freie UniversitäT Berlin
Curated by ChEMBL
LigandPNGBDBM50324042(4'-[(5,6-Dibromo-2-propyl-1H-benzo[d]imidazol-1-yl...)
Affinity DataEC50:  400nM. Assay description: Activation of Gal4-tagged human PPARgamma expressed in CHO cells by luciferase reporter gene assay
In DepthDetails ArticlePubMed