BDBM50324133 3-tert-butyl 5-methyl 2,6-dimethyl-4-(4-(trifluoromethyl)phenyl)-1,4-dihydropyridine-3,5-dicarboxylate::CHEMBL1215193
SMILES COC(=O)C1C(C(C(=O)OC(C)(C)C)=C(C)N=C1C)c1ccc(cc1)C(F)(F)F
InChI Key InChIKey=WJKWBWWNWDKSJT-UHFFFAOYSA-N
Data  1 IC50
  Tab Delimited (TSV)   2D SDfile   Computed 3D by Vconf -m prep SDfile
Find this compound or compounds like it in BindingDB:
Activity Spreadsheet -- Enzyme Inhibition Constant Data from BindingDB
Found 1 hit for monomerid = 50324133
TargetMineralocorticoid receptor(Homo sapiens (Human))
Pfizer
Curated by ChEMBL
LigandPNGBDBM50324133(3-tert-butyl 5-methyl 2,6-dimethyl-4-(4-(trifluoro...)
Affinity DataIC50:  309nM. Assay description: Antagonist activity at mineralocorticoid receptor LBD expressed in human HUH7 cells coexpressing GAL4 by luciferase reporter gene assay
In DepthDetails ArticlePubMed