BDBM50324157 CHEMBL1215549::Methyl 4-(2-Chloro-4-fluorophenyl)-5-cyano-1,4-dihydro-6-methyl-2-propylpyridine-3-carboxylate
SMILES CCCC1=C(C(C(C#N)C(C)=N1)c1ccc(F)cc1Cl)C(=O)OC
InChI Key InChIKey=CLQBRBFJGFBWMS-UHFFFAOYSA-N
Data  4 IC50
  Tab Delimited (TSV)   2D SDfile   Computed 3D by Vconf -m prep SDfile
Find this compound or compounds like it in BindingDB:
Activity Spreadsheet -- Enzyme Inhibition Constant Data from BindingDB
Found 4 hits for monomerid = 50324157
TargetMineralocorticoid receptor(Homo sapiens (Human))
Pfizer
Curated by ChEMBL
LigandPNGBDBM50324157(CHEMBL1215549 | Methyl 4-(2-Chloro-4-fluorophenyl)...)
Affinity DataIC50:  16nM. Assay description: Antagonist activity at mineralocorticoid receptor LBD expressed in human HUH7 cells coexpressing GAL4 by luciferase reporter gene assay
In DepthDetails ArticlePubMed
TargetProgesterone receptor(Homo sapiens (Human))
Pfizer
Curated by ChEMBL
LigandPNGBDBM50324157(CHEMBL1215549 | Methyl 4-(2-Chloro-4-fluorophenyl)...)
Affinity DataIC50: >1.00E+4nM. Assay description: Antagonist activity at progesterone receptor LBD expressed in human HUH7 cells coexpressing GAL4 by luciferase reporter gene assay
In DepthDetails ArticlePubMed
TargetAndrogen receptor(Homo sapiens (Human))
Pfizer
Curated by ChEMBL
LigandPNGBDBM50324157(CHEMBL1215549 | Methyl 4-(2-Chloro-4-fluorophenyl)...)
Affinity DataIC50:  100nM. Assay description: Antagonist activity at androgen receptor LBD expressed in human HUH7 cells coexpressing GAL4 by luciferase reporter gene assay
In DepthDetails ArticlePubMed
TargetGlucocorticoid receptor(Homo sapiens (Human))
Pfizer
Curated by ChEMBL
LigandPNGBDBM50324157(CHEMBL1215549 | Methyl 4-(2-Chloro-4-fluorophenyl)...)
Affinity DataIC50:  700nM. Assay description: Antagonist activity at glucocorticoid receptor LBD expressed in human HUH7 cells coexpressing GAL4 by luciferase reporter gene assay
In DepthDetails ArticlePubMed