BDBM50324164 4-[(5S)-5-(4-Fluorophenyl)-3-(2-oxo-2,3-dihydro-1,3-benzoxazol-6-yl)-4,5-dihydro-1H-pyrazol-1-yl]benzonitrile::CHEMBL1215692
SMILES Fc1ccc(cc1)[C@@H]1CC(=NN1c1ccc(cc1)C#N)c1ccc2[nH]c(=O)oc2c1
InChI Key InChIKey=FXUCYRRIEXLTRF-NRFANRHFSA-N
Data  1 IC50
  Tab Delimited (TSV)   2D SDfile   Computed 3D by Vconf -m prep SDfile
Find this compound or compounds like it in BindingDB:
Activity Spreadsheet -- Enzyme Inhibition Constant Data from BindingDB
Found 1 hit for monomerid = 50324164
TargetMineralocorticoid receptor(Homo sapiens (Human))
Pfizer
Curated by ChEMBL
LigandPNGBDBM50324164(4-[(5S)-5-(4-Fluorophenyl)-3-(2-oxo-2,3-dihydro-1,...)
Affinity DataIC50:  2.08E+3nM. Assay description: Antagonist activity at Gal4-tagged mineralocorticoid receptor expressed in human Huh7 cells by luciferase reporter gene assay
In DepthDetails ArticlePubMed