BDBM50324327 2'-(1-Methyl-1H-pyrazol-3-ylamino)-6-piperazin-1-yl[2,4']bipyridinyl-4-carboxylic Acid Amide::CHEMBL1215074
SMILES Cn1ccc(Nc2cc(ccn2)-c2cc(cc(n2)N2CCNCC2)C(N)=O)n1
InChI Key InChIKey=HCMOZLPTNMKKAS-UHFFFAOYSA-N
Data  2 IC50  1 EC50
  Tab Delimited (TSV)   2D SDfile   Computed 3D by Vconf -m prep SDfile
Find this compound or compounds like it in BindingDB:
Activity Spreadsheet -- Enzyme Inhibition Constant Data from BindingDB
Found 3 hits for monomerid = 50324327
TargetSerine/threonine-protein kinase D1(Homo sapiens (Human))
Novartis Institutes For Biomedical Research
Curated by ChEMBL
LigandPNGBDBM50324327(2'-(1-Methyl-1H-pyrazol-3-ylamino)-6-piperazin-1-y...)
Affinity DataIC50:  1nM. Assay description: Inhibition of PKD1 by TR-FRET assay
In DepthDetails ArticlePubMed
TargetPolycystin-2(Homo sapiens (Human))
Novartis Institutes For Biomedical Research
Curated by ChEMBL
LigandPNGBDBM50324327(2'-(1-Methyl-1H-pyrazol-3-ylamino)-6-piperazin-1-y...)
Affinity DataIC50:  7nM. Assay description: Inhibition of PKD2 by TR-FRET assay
In DepthDetails ArticlePubMed
TargetSerine/threonine-protein kinase D1(Homo sapiens (Human))
Novartis Institutes For Biomedical Research
Curated by ChEMBL
LigandPNGBDBM50324327(2'-(1-Methyl-1H-pyrazol-3-ylamino)-6-piperazin-1-y...)
Affinity DataEC50:  674nM. Assay description: Inhibition of PKD1 assessed as inhibition of HDAC5 neuclear export
In DepthDetails ArticlePubMed