BDBM50324488 CHEMBL1215294::N-(2-Amino-2-oxoethyl)-5-(3-hydroxyphenyl)thiophene-2-carboxamide
SMILES NC(=O)CNC(=O)c1ccc(s1)-c1cccc(O)c1
InChI Key InChIKey=AONIMFORDXSSBY-UHFFFAOYSA-N
Data  1 IC50
  Tab Delimited (TSV)   2D SDfile   Computed 3D by Vconf -m prep SDfile
Find this compound or compounds like it in BindingDB:
Activity Spreadsheet -- Enzyme Inhibition Constant Data from BindingDB
Found 1 hit for monomerid = 50324488
TargetHematopoietic prostaglandin D synthase(Homo sapiens (Human))
The University Of Queensland
Curated by ChEMBL
LigandPNGBDBM50324488(CHEMBL1215294 | N-(2-Amino-2-oxoethyl)-5-(3-hydrox...)
Affinity DataIC50:  8.00E+3nM. Assay description: Inhibition of human H-PGDS expressed in Escherichia coli BL21 DE2 by enzyme immuno assay
In DepthDetails ArticlePubMed