BDBM50324687 CHEMBL1221699::N-(4-(phenylamino)quinazolin-6-yl)acrylamide::N-(4-PHENYLAMINO-QUINAZOLIN-6-YL)-ACRYLAMIDE
SMILES C=CC(=O)Nc1ccc2ncnc(Nc3ccccc3)c2c1
InChI Key InChIKey=JGWHILNNHLDARR-UHFFFAOYSA-N
Data  2 IC50
PDB links: 1 PDB ID matches this monomer.
  Tab Delimited (TSV)   2D SDfile   Computed 3D by Vconf -m prep SDfile
Find this compound or compounds like it in BindingDB:
Activity Spreadsheet -- Enzyme Inhibition Constant Data from BindingDB
Found 2 hits for monomerid = 50324687
TargetTyrosine-protein kinase Fyn(Homo sapiens (Human))
University Of California
Curated by ChEMBL
LigandPNGBDBM50324687(CHEMBL1221699 | N-(4-(phenylamino)quinazolin-6-yl)...)
Affinity DataIC50:  3.70E+3nM. Assay description: Inhibition of Fyn expressed in Escherichia coli C43 by radioactive phosphotransfer assay
In DepthDetails ArticlePubMed
TargetProto-oncogene tyrosine-protein kinase Src(Homo sapiens (Human))
University Of California
Curated by ChEMBL
LigandPNGBDBM50324687(CHEMBL1221699 | N-(4-(phenylamino)quinazolin-6-yl)...)
Affinity DataIC50: >2.70E+4nM. Assay description: Inhibition of c-src in by radioactive phosphotransfer assay
In DepthDetails ArticlePubMed