BDBM50324779 (3R,4R)-1-METHANESULFONYL-PYRROLIDINE-3,4-DICARBOXYLIC ACID 3-[(4-CHLORO-3-FLUORO-PHENYL)-AMIDE] 4-{[2-FLUORO-4-(2-OXO-2H-PYRIDIN-1-YL)-PHENYL]-AMIDE}::(3R,4R)-N3-(4-chloro-3-fluorophenyl)-N4-(2-fluoro-4-(2-oxopyridin-1(2H)-yl)phenyl)-1-(methylsulfonyl)pyrrolidine-3,4-dicarboxamide::CHEMBL1222130
SMILES CS(=O)(=O)N1C[C@@H]([C@H](C1)C(=O)Nc1ccc(cc1F)-n1ccccc1=O)C(=O)Nc1ccc(Cl)c(F)c1
InChI Key InChIKey=XRNMSDIWHHURFN-IRXDYDNUSA-N
Data  1 KI
PDB links: 1 PDB ID matches this monomer.
  Tab Delimited (TSV)   2D SDfile   Computed 3D by Vconf -m prep SDfile
Find this compound or compounds like it in BindingDB:
Activity Spreadsheet -- Enzyme Inhibition Constant Data from BindingDB
Found 1 hit for monomerid = 50324779
TargetCoagulation factor X(Homo sapiens (Human))
F. Hoffmann-La Roche
Curated by ChEMBL
LigandPNGBDBM50324779((3R,4R)-1-METHANESULFONYL-PYRROLIDINE-3,4-DICARBOX...)
Affinity DataKi:  62nM. Assay description: Binding affinity to factor 10a