BDBM50324832 (R)-7-(2-(bi(cyclohexan)-2-ylamino)-1-hydroxyethyl)-4-hydroxybenzo[d]thiazol-2(3H)-one::CHEMBL1221801
SMILES O[C@@H](CNC1CCCCC1C1CCCCC1)c1ccc(O)c2[nH]c(=O)sc12
InChI Key InChIKey=XEDUTQMPNJLZKT-PVARCSIZSA-N
Data  2 KI
  Tab Delimited (TSV)   2D SDfile   Computed 3D by Vconf -m prep SDfile
Find this compound or compounds like it in BindingDB:
Activity Spreadsheet -- Enzyme Inhibition Constant Data from BindingDB
Found 2 hits for monomerid = 50324832
TargetBeta-2 adrenergic receptor(Homo sapiens (Human))
Novartis Institutes For Biomedical Research
Curated by ChEMBL
LigandPNGBDBM50324832((R)-7-(2-(bi(cyclohexan)-2-ylamino)-1-hydroxyethyl...)
Affinity DataKi:  151nM. Assay description: Displacement of [3H]CGP12177 from human beta2 adrenoceptor
In DepthDetails ArticlePubMed
TargetBeta-1 adrenergic receptor(Homo sapiens (Human))
Novartis Institutes For Biomedical Research
Curated by ChEMBL
LigandPNGBDBM50324832((R)-7-(2-(bi(cyclohexan)-2-ylamino)-1-hydroxyethyl...)
Affinity DataKi:  662nM. Assay description: Displacement of [3H]CGP12177 from human beta-1 adrenoceptor
In DepthDetails ArticlePubMed