BDBM50324903 4-(2-amino-5-chloro-1H-benzimidazol-1-yl)-N-cyclohexyl-N-methylbutanamide::4-(2-amino-5-chloro-1H-benzo[d]imidazol-1-yl)-N-cyclohexyl-N-methylbutanamide::CHEMBL1221977
SMILES CN(C1CCCCC1)C(=O)CCCn1c(N)nc2cc(Cl)ccc12
InChI Key InChIKey=UIWHCBCBZBYNDS-UHFFFAOYSA-N
Data  1 IC50
PDB links: 1 PDB ID matches this monomer.
  Tab Delimited (TSV)   2D SDfile   Computed 3D by Vconf -m prep SDfile
Find this compound or compounds like it in BindingDB:
Activity Spreadsheet -- Enzyme Inhibition Constant Data from BindingDB
Found 1 hit for monomerid = 50324903
TargetBeta-secretase 1(Homo sapiens (Human))
Evotec
Curated by ChEMBL
LigandPNGBDBM50324903(4-(2-amino-5-chloro-1H-benzimidazol-1-yl)-N-cycloh...)
Affinity DataIC50:  2.60E+4nM. Assay description: Inhibition of BACE1 assessed as amyloid beta secretion by cell based assay