BDBM50324909 4-(2-amino-5-chloro-1H-benzo[d]imidazol-1-yl)-N-(1-methylpiperidin-4-yl)butanamide::CHEMBL1222032
SMILES CN1CCC(CC1)NC(=O)CCCn1c(N)nc2cc(Cl)ccc12
InChI Key InChIKey=WCPKOJUODFAWNB-UHFFFAOYSA-N
Data  1 IC50
  Tab Delimited (TSV)   2D SDfile   Computed 3D by Vconf -m prep SDfile
Find this compound or compounds like it in BindingDB:
Activity Spreadsheet -- Enzyme Inhibition Constant Data from BindingDB
Found 1 hit for monomerid = 50324909
TargetBeta-secretase 1(Homo sapiens (Human))
Evotec
Curated by ChEMBL
LigandPNGBDBM50324909(4-(2-amino-5-chloro-1H-benzo[d]imidazol-1-yl)-N-(1...)
Affinity DataIC50:  3.25E+5nM. Assay description: Inhibition of BACE1 assessed as amyloid beta secretion by cell based assay
In DepthDetails ArticlePubMed