BDBM50325211 2-(4-((1H-1,2,4-Triazol-1-yl)methyl)-5-(4-bromophenyl)-1-(2-chlorophenyl)-1H-pyrazol-3-yl)-5-tert-butyl-1,3,4-thiadiazole::CHEMBL1223259
SMILES CC(C)(C)c1nnc(s1)-c1nn(c(c1Cn1cncn1)-c1ccc(Br)cc1)-c1ccccc1Cl
InChI Key InChIKey=OVNVZWSCIAIPJL-UHFFFAOYSA-N
Data  7 IC50
  Tab Delimited (TSV)   2D SDfile   Computed 3D by Vconf -m prep SDfile
Find this compound or compounds like it in BindingDB:
Activity Spreadsheet -- Enzyme Inhibition Constant Data from BindingDB
Found 7 hits for monomerid = 50325211
TargetCytochrome P450 1A2(Homo sapiens (Human))
Green Cross
Curated by ChEMBL
LigandPNGBDBM50325211(2-(4-((1H-1,2,4-Triazol-1-yl)methyl)-5-(4-bromophe...)
Affinity DataIC50: >20nM. Assay description: Inhibition of CYP1A2 in human liver microsomes after 30 mins
In DepthDetails ArticlePubMed
TargetCytochrome P450 2C9(Homo sapiens (Human))
Green Cross
Curated by ChEMBL
LigandPNGBDBM50325211(2-(4-((1H-1,2,4-Triazol-1-yl)methyl)-5-(4-bromophe...)
Affinity DataIC50: >20nM. Assay description: Inhibition of CYP2C9 in human liver microsomes after 30 mins
In DepthDetails ArticlePubMed
TargetCytochrome P450 2D6(Homo sapiens (Human))
Green Cross
Curated by ChEMBL
LigandPNGBDBM50325211(2-(4-((1H-1,2,4-Triazol-1-yl)methyl)-5-(4-bromophe...)
Affinity DataIC50: >20nM. Assay description: Inhibition of CYP2D6 in human liver microsomes after 30 mins
In DepthDetails ArticlePubMed
TargetCannabinoid receptor 1(Rattus norvegicus (rat))
Green Cross
Curated by ChEMBL
LigandPNGBDBM50325211(2-(4-((1H-1,2,4-Triazol-1-yl)methyl)-5-(4-bromophe...)
Affinity DataIC50:  0.681nM. Assay description: Displacement of [3H]CP-55940 from CB1 receptor in Sprague-Dawley rat cerebellum after 1 hr by liquid scintillation counting
In DepthDetails ArticlePubMed
TargetCannabinoid receptor 2(Homo sapiens (Human))
Green Cross
Curated by ChEMBL
LigandPNGBDBM50325211(2-(4-((1H-1,2,4-Triazol-1-yl)methyl)-5-(4-bromophe...)
Affinity DataIC50:  549nM. Assay description: Displacement of [3H]WIN-55212-2 from human CB2 receptor expressed in CHO-K1 cells after 1 hr by liquid scintillation counting
In DepthDetails ArticlePubMed
TargetPotassium voltage-gated channel subfamily H member 2(Homo sapiens (Human))
Green Cross
Curated by ChEMBL
LigandPNGBDBM50325211(2-(4-((1H-1,2,4-Triazol-1-yl)methyl)-5-(4-bromophe...)
Affinity DataIC50:  1.05E+4nM. Assay description: Inhibition of human ERG at holding potential of -80 mV to +40 mV
In DepthDetails ArticlePubMed
TargetCytochrome P450 3A4(Homo sapiens (Human))
Green Cross
Curated by ChEMBL
LigandPNGBDBM50325211(2-(4-((1H-1,2,4-Triazol-1-yl)methyl)-5-(4-bromophe...)
Affinity DataIC50: >20nM. Assay description: Inhibition of CYP3A4 in human liver microsomes after 30 mins
In DepthDetails ArticlePubMed