BDBM50325287 CHEMBL1223044::N-(2-(dimethylamino)ethyl)-5-((6-(4-hydroxy-3-methoxyphenyl)-2-oxoindolin-3-ylidene)methyl)selenophene-2-carboxamide
SMILES COc1cc(ccc1O)-c1ccc2\C(=C\c3ccc([se]3)C(=O)NCCN(C)C)C(=O)Nc2c1
InChI Key InChIKey=DURKVIQNHRPQQK-RGEXLXHISA-N
Data  1 IC50
  Tab Delimited (TSV)   2D SDfile   Computed 3D by Vconf -m prep SDfile
Find this compound or compounds like it in BindingDB:
Activity Spreadsheet -- Enzyme Inhibition Constant Data from BindingDB
Found 1 hit for monomerid = 50325287
TargetSerine/threonine-protein kinase Chk1(Homo sapiens (Human))
Development Center For Biotechnology
Curated by ChEMBL
LigandPNGBDBM50325287(CHEMBL1223044 | N-(2-(dimethylamino)ethyl)-5-((6-(...)
Affinity DataIC50:  2.60nM. Assay description: Inhibition of human recombinant GST-Chk1after 30 mins
In DepthDetails ArticlePubMed