BDBM50325359 (R)-N-(1-cyclohexyl-2-(methylamino)-2-oxoethyl)-5-(3-((5-methylfuran-2-carboxamido)methyl)phenyl)furan-2-carboxamide::CHEMBL1223059
SMILES CNC(=O)[C@H](NC(=O)c1ccc(o1)-c1cccc(CNC(=O)c2ccc(C)o2)c1)C1CCCCC1
InChI Key InChIKey=VLGINQGZOTZBAC-XMMPIXPASA-N
Data  1 IC50
  Tab Delimited (TSV)   2D SDfile   Computed 3D by Vconf -m prep SDfile
Find this compound or compounds like it in BindingDB:
Activity Spreadsheet -- Enzyme Inhibition Constant Data from BindingDB
Found 1 hit for monomerid = 50325359
TargetCollagenase 3(Homo sapiens (Human))
Boehringer Ingelheim Pharmaceuticals
Curated by ChEMBL
LigandPNGBDBM50325359((R)-N-(1-cyclohexyl-2-(methylamino)-2-oxoethyl)-5-...)
Affinity DataIC50:  11nM. Assay description: Inhibition of MMP13
In DepthDetails ArticlePubMed