BDBM50325616 (7-fluoro-1H-indol-5-yl)(3-isobutyl pyrrolidin-3-yl)methanone::(7-fluoro-1H-indol-5-yl)(3-isobutylpyrrolidin-3-yl)methanone::CHEMBL1224490
SMILES CC(C)CC1(CCNC1)C(=O)c1cc(F)c2[nH]ccc2c1
InChI Key InChIKey=BLKNUASSHDJVDJ-UHFFFAOYSA-N
Data  2 IC50
  Tab Delimited (TSV)   2D SDfile   Computed 3D by Vconf -m prep SDfile
Find this compound or compounds like it in BindingDB:
Activity Spreadsheet -- Enzyme Inhibition Constant Data from BindingDB
Found 2 hits for monomerid = 50325616
TargetCytochrome P450 2D6(Homo sapiens (Human))
Roche Palo Alto
Curated by ChEMBL
LigandPNGBDBM50325616((7-fluoro-1H-indol-5-yl)(3-isobutyl pyrrolidin-3-y...)
Affinity DataIC50:  1.00E+3nM. Assay description: Inhibition of CYP2D6
In DepthDetails ArticlePubMed
TargetCytochrome P450 2D6(Homo sapiens (Human))
Roche Palo Alto
Curated by ChEMBL
LigandPNGBDBM50325616((7-fluoro-1H-indol-5-yl)(3-isobutyl pyrrolidin-3-y...)
Affinity DataIC50:  1.00E+3nM. Assay description: Inhibition of CYP2D6
In DepthDetails ArticlePubMed